Target
Carbonic anhydrase 2
Ligand
BDBM14726
Substrate
BDBM11326
Meas. Tech.
Esterase Assay
Ki
1.61±n/a nM
Citation
 Casey, JRMorgan, PEVullo, DScozzafava, AMastrolorenzo, ASupuran, CT Carbonic anhydrase inhibitors. Design of selective, membrane-impermeant inhibitors targeting the human tumor-associated isozyme IX. J Med Chem 47:2337-47 (2004)  
Target
Name:
Carbonic anhydrase 2
Synonyms:
CA-II CAC Carbonate dehydratase II Carbonic anhydrase 2 (CA-II) Carbonic anhydrase C Carbonic anhydrase II (CA-II) Carbonic anhydrase II (hCA II) | Carbonic anhydrase isoenzyme II (hCA II)
Type:
Enzyme
Mol. Mass.:
29250.71
Organism:
Homo sapiens (Human)
Description:
P00918
Residue:
260
  
Inhibitor
Name:
BDBM14726
Synonyms:
1-N-[5-Sulfamoyl-1,3,4-thiadiazol-2-yl-(aminosulfonyl-4-phenyl)]-2,6-di-isopropyl-4-phenylpyridinium perchlorate pyridinium-containing sulfonamide analog 14i
Type:
Small organic molecule
Emp. Form.:
C25H28N5O4S3
Mol. Mass.:
558.715
SMILES:
CC(C)c1cc(cc(C(C)C)[n+]1-c1ccc(cc1)S(=O)(=O)Nc1nnc(s1)S(N)(=O)=O)-c1ccccc1
:
Substrate
Name:
BDBM11326
Synonyms:
4-nitrophenyl acetate | p-Nitrophenyl Acetate
Type:
Small organic molecule
Emp. Form.:
C8H7NO4
Mol. Mass.:
181.1455
SMILES:
CC(=O)Oc1ccc(cc1)[N+]([O-])=O
: