Target
High affinity cGMP-specific 3',5'-cyclic phosphodiesterase 9A [226-593]
Ligand
BDBM14390
Substrate
BDBM14391
IC50
5600±n/a nM
Citation
 Card, GLEngland, BPSuzuki, YFong, DPowell, BLee, BLuu, CTabrizizad, MGillette, SIbrahim, PNArtis, DRBollag, GMilburn, MVKim, SHSchlessinger, JZhang, KY Structural basis for the activity of drugs that inhibit phosphodiesterases. Structure 12:2233-47 (2004)  
Target
Name:
High affinity cGMP-specific 3',5'-cyclic phosphodiesterase 9A [226-593]
Synonyms:
High-affinity cGMP-specific 3,5-cyclic phosphodiesterase 9A PDE9A_HUMAN | Phosphodiesterase Type 9 (PDE9A)
Type:
Enzyme Catalytic Domain
Mol. Mass.:
43183.20
Organism:
Homo sapiens (Human)
Description:
Recombinant catalytic domain (S226-A593) of human PDE9A.
Residue:
368
  
Inhibitor
Name:
BDBM14390
Synonyms:
5-[2-ethoxy-5-(4-methyl-1-piperazinylsulfonyl)phenyl]-1-methyl-3-n-propyl-1,6-dihydro-7H-pyrazolo[4,3-d]pyrimidin-7-one CHEMBL192 Sildenafil US11155558, Compound sildenafil Viagra
Type:
Small organic molecule
Emp. Form.:
C22H30N6O4S
Mol. Mass.:
474.576
SMILES:
CCCc1nn(C)c2c1nc([nH]c2=O)-c1cc(ccc1OCC)S(=O)(=O)N1CCN(C)CC1
:
Substrate
Name:
BDBM14391
Synonyms:
2-amino-9-[(4aR,6R,7R,7aS)-2,7-dihydroxy-2-oxidotetrahydro-4H-furo[3,2-d][1,3,2]dioxaphosphinin-6-yl]-1,9-dihydro-6H-purin-6-one GUANOSINE-3 ,5 -MONOPHOSPHATE cGMP
Type:
Nucleoside or nucleotide
Emp. Form.:
C10H12N5O7P
Mol. Mass.:
345.2053
SMILES:
Nc1nc2n(cnc2c(=O)[nH]1)[C@@H]1O[C@@H]2COP(O)(=O)O[C@H]2[C@H]1O
: