Target
Angiopoietin-1 receptor
Ligand
BDBM14969
Substrate
Her2 Peptide Substrate
Meas. Tech.
Homogeneous Time-Resolved Fluorescence (HTRF) Enzyme Assay
pH
7.5±n/a
Temperature
295.15±n/a K
IC50
10±n/a nM
Citation
 Cee, VJAlbrecht, BKGeuns-Meyer, SHughes, PBellon, SBready, JCaenepeel, SChaffee, SCCoxon, AEmery, MFretland, JGallant, PGu, YHodous, BLHoffman, DJohnson, REKendall, RKim, JLLong, AMMcGowan, DMorrison, MOlivieri, PRPatel, VFPolverino, APowers, DRose, PWang, LZhao, H Alkynylpyrimidine amide derivatives as potent, selective, and orally active inhibitors of Tie-2 kinase. J Med Chem 50:627-40 (2007)  
Target
Name:
Angiopoietin-1 receptor
Synonyms:
TEK TIE2_HUMAN Tyrosine-protein kinase receptor (TIE-2) Tyrosine-protein kinase receptor TEK (p140 TEK) Tyrosine-protein kinase receptor TIE2/TEK VMCM1 p140 TEK
Type:
Enzyme
Mol. Mass.:
125835.70
Organism:
Homo sapiens (Human)
Description:
Q02763
Residue:
1124
  
Inhibitor
Name:
BDBM14969
Synonyms:
4-Methyl-3-(2-(quinolin-3-yl)ethynyl)-N-(3-(trifluoromethyl)-phenyl)benzamide heterocyclic akynyl amide 13d
Type:
Small organic molecule
Emp. Form.:
C26H17F3N2O
Mol. Mass.:
430.4212
SMILES:
Cc1ccc(cc1C#Cc1cnc2ccccc2c1)C(=O)Nc1cccc(c1)C(F)(F)F
:
Substrate
Name:
Her2 Peptide Substrate
Synonyms:
Biotinylated Her2 Peptide Substrate | biotinylated long chain peptide
Type:
Peptide
Mol. Mass.:
2278.65
Organism:
Description:
Residue:
20