Target
Orexin receptor type 2
Ligand
BDBM205118
Substrate
Orexin receptor 1
Meas. Tech.
Radioligand binding assay
Ki
0.3±n/a nM
Citation
 Kuduk, SDSkudlarek, JW 2-pyridyloxy-3-substituted-4-nitrile orexin receptor antagonists US Patent  US9546152 Publication Date 1/17/2017 
Target
Name:
Orexin receptor type 2
Synonyms:
HCRTR2 OX2R_HUMAN Orexin receptor type 2 (OR-2) Orexin receptor type 2 (OX2R) Ox-2-R | Ox2-R
Type:
Protein
Mol. Mass.:
50710.53
Organism:
Homo sapiens (Human)
Description:
O43614
Residue:
444
  
Inhibitor
Name:
BDBM205118
Synonyms:
3-methyl-2-{[(3r,6r)-6- methyl-1-{[2-(1,3-oxazol-2- yl)phenyl]carbonyl}piperidin- 3-yl]oxy}pyridine-4- carbonitrile | US9546152, example 27
Type:
Small organic molecule
Emp. Form.:
C23H22N4O3
Mol. Mass.:
402.4458
SMILES:
C[C@@H]1CC[C@H](CN1C(=O)c1ccccc1-c1ncco1)Oc1nccc(C#N)c1C
:
Substrate
Name:
Orexin/Hypocretin receptor type 1
Synonyms:
HCRTR1 OX1R_HUMAN Orexin receptor type 1 (OR 1) Orexin receptor type 1 (OX1) Orexin receptor type 1 (OxR1) | Ox1r
Type:
Protein
Mol. Mass.:
47554.50
Organism:
Homo sapiens (Human)
Description:
O43613
Residue:
425