Target
Orexin receptor type 2
Ligand
BDBM205244
Substrate
Orexin receptor 1
Meas. Tech.
Radioligand binding assay
Ki
0.2±n/a nM
Citation
 Kuduk, SDSkudlarek, JW 2-pyridyloxy-3-substituted-4-nitrile orexin receptor antagonists US Patent  US9546152 Publication Date 1/17/2017 
Target
Name:
Orexin receptor type 2
Synonyms:
HCRTR2 OX2R_HUMAN Orexin receptor type 2 (OR-2) Orexin receptor type 2 (OX2R) Ox-2-R | Ox2-R
Type:
Protein
Mol. Mass.:
50710.53
Organism:
Homo sapiens (Human)
Description:
O43614
Residue:
444
  
Inhibitor
Name:
BDBM205244
Synonyms:
US9546152, example 92
Type:
Small organic molecule
Emp. Form.:
C24H24N6O2
Mol. Mass.:
428.4864
SMILES:
C[C@@H]1CC[C@H](CN1C(=O)c1ccccc1-n1nccn1)Oc1nccc(C#N)c1C1CC1
:
Substrate
Name:
Orexin/Hypocretin receptor type 1
Synonyms:
HCRTR1 OX1R_HUMAN Orexin receptor type 1 (OR 1) Orexin receptor type 1 (OX1) Orexin receptor type 1 (OxR1) | Ox1r
Type:
Protein
Mol. Mass.:
47554.50
Organism:
Homo sapiens (Human)
Description:
O43613
Residue:
425