Target
Orexin receptor type 2
Ligand
BDBM205260
Substrate
Orexin receptor 1
Meas. Tech.
Radioligand binding assay
Ki
0.1±n/a nM
Citation
 Kuduk, SDSkudlarek, JW 2-pyridyloxy-3-substituted-4-nitrile orexin receptor antagonists US Patent  US9546152 Publication Date 1/17/2017 
Target
Name:
Orexin receptor type 2
Synonyms:
HCRTR2 OX2R_HUMAN Orexin receptor type 2 (OR-2) Orexin receptor type 2 (OX2R) Ox-2-R | Ox2-R
Type:
Protein
Mol. Mass.:
50710.53
Organism:
Homo sapiens (Human)
Description:
O43614
Residue:
444
  
Inhibitor
Name:
BDBM205260
Synonyms:
US9546152, example 95
Type:
Small organic molecule
Emp. Form.:
C22H22N6O2S
Mol. Mass.:
434.514
SMILES:
CSc1c(O[C@@H]2CC[C@@H](C)N(C2)C(=O)c2ccccc2-n2nccn2)nccc1C#N
:
Substrate
Name:
Orexin/Hypocretin receptor type 1
Synonyms:
HCRTR1 OX1R_HUMAN Orexin receptor type 1 (OR 1) Orexin receptor type 1 (OX1) Orexin receptor type 1 (OxR1) | Ox1r
Type:
Protein
Mol. Mass.:
47554.50
Organism:
Homo sapiens (Human)
Description:
O43613
Residue:
425