Target
RAC-beta serine/threonine-protein kinase
Ligand
BDBM2579
Substrate
biotinylated Akt peptide substrate
Meas. Tech.
Akt Kinase Assay
pH
7.5±n/a
Temperature
295.15±n/a K
IC50
6.5±n/a nM
Citation
 Li, QWoods, KWThomas, SZhu, GDPackard, GFisher, JLi, TGong, JDinges, JSong, XAbrams, JLuo, YJohnson, EFShi, YLiu, XKlinghofer, VDes Jong, ROltersdorf, TStoll, VSJakob, CGRosenberg, SHGiranda, VL Synthesis and structure-activity relationship of 3,4'-bispyridinylethylenes: discovery of a potent 3-isoquinolinylpyridine inhibitor of protein kinase B (PKB/Akt) for the treatment of cancer. Bioorg Med Chem Lett 16:2000-7 (2006)  
Target
Name:
RAC-beta serine/threonine-protein kinase
Synonyms:
AKT2 PKB beta Protein kinase B (Akt 2) Protein kinase B, beta RAC-alpha serine/threonine-protein kinase (AKT2) RAC-beta serine/threonine-protein kinase (AKT2) Serine/threonine-protein kinase AKT2 | Serine/threonine-protein kinase Rac alpha/beta
Type:
Enzyme
Mol. Mass.:
55766.64
Organism:
Homo sapiens (Human)
Description:
Residue:
481
  
Inhibitor
Name:
BDBM2579
Synonyms:
(2S,3R,4R,6R)-3-methoxy-2-methyl-4-(methylamino)-29-oxa-1,7,17-triazaoctacyclo[12.12.2.1^{2,6}.0^{7,28}.0^{8,13}.0^{15,19}.0^{20,27}.0^{21,26}]nonacosa-8(13),9,11,14(28),15(19),20(27),21(26),22,24-nonaen-16-one Staurosporin, 4 Staurosporine, 8 US9206188, Staurosporine | US9226923, Staurosporine
Type:
Small organic molecule
Emp. Form.:
C28H26N4O3
Mol. Mass.:
466.531
SMILES:
CN[C@@H]1C[C@H]2O[C@@](C)([C@@H]1OC)n1c3ccccc3c3c4CNC(=O)c4c4c5ccccc5n2c4c13
:
Substrate
Name:
biotinylated Akt peptide substrate
Synonyms:
Type:
Biotinylated Peptide
Mol. Mass.:
3178.04
Organism:
Description:
Km=15 uM
Residue:
28