Target
Mitogen-activated protein kinase 10
Ligand
BDBM15907
Substrate
biotinylated GST-ATF2
Meas. Tech.
Kinase Selectivity Assay
Ki
520±n/a nM
Citation
 Szczepankiewicz, BGKosogof, CNelson, LTLiu, GLiu, BZhao, HSerby, MDXin, ZLiu, MGum, RJHaasch, DLWang, SClampit, JEJohnson, EFLubben, THStashko, MAOlejniczak, ETSun, CDorwin, SAHaskins, KAbad-Zapatero, CFry, EHHutchins, CWSham, HLRondinone, CMTrevillyan, JM Aminopyridine-based c-Jun N-terminal kinase inhibitors with cellular activity and minimal cross-kinase activity. J Med Chem 49:3563-80 (2006)  
Target
Name:
Mitogen-activated protein kinase 10
Synonyms:
JNK3 MAP kinase p49 3F12 MK10_HUMAN Mitogen-activated protein kinase 10 (Stress-activated protein kinase JNK3) (c-Jun N-terminal kinase 3) (MAP kinase p49 3F12) PRKM10 Stress-activated protein kinase JNK3 | c-Jun N-terminal kinase 3 (JNK3)
Type:
Enzyme
Mol. Mass.:
52586.89
Organism:
Homo sapiens (Human)
Description:
Residue:
464
  
Inhibitor
Name:
BDBM15907
Synonyms:
Aminopyridine-Based Inhibitor 6a aminopyridine deriv. 1
Type:
Small organic molecule
Emp. Form.:
C10H12N4O2
Mol. Mass.:
220.2279
SMILES:
CCOc1nc(NC(C)=O)cc(N)c1C#N
:
Substrate
Name:
biotinylated GST-ATF2
Synonyms:
ATF-2-GST Activating transcription factor 2 GST-ATF2 biotinylated activating transcription factor 2
Type:
Other Protein Type
Mol. Mass.:
12237.77
Organism:
Homo sapiens (Human)
Description:
Residue:
109