Target
Mitogen-activated protein kinase 10
Ligand
BDBM15976
Substrate
biotinylated GST-ATF2
Meas. Tech.
Kinase Selectivity Assay
Ki
61±n/a nM
Citation
 Szczepankiewicz, BGKosogof, CNelson, LTLiu, GLiu, BZhao, HSerby, MDXin, ZLiu, MGum, RJHaasch, DLWang, SClampit, JEJohnson, EFLubben, THStashko, MAOlejniczak, ETSun, CDorwin, SAHaskins, KAbad-Zapatero, CFry, EHHutchins, CWSham, HLRondinone, CMTrevillyan, JM Aminopyridine-based c-Jun N-terminal kinase inhibitors with cellular activity and minimal cross-kinase activity. J Med Chem 49:3563-80 (2006)  
Target
Name:
Mitogen-activated protein kinase 10
Synonyms:
JNK3 MAP kinase p49 3F12 MK10_HUMAN Mitogen-activated protein kinase 10 (Stress-activated protein kinase JNK3) (c-Jun N-terminal kinase 3) (MAP kinase p49 3F12) PRKM10 Stress-activated protein kinase JNK3 | c-Jun N-terminal kinase 3 (JNK3)
Type:
Enzyme
Mol. Mass.:
52586.89
Organism:
Homo sapiens (Human)
Description:
Residue:
464
  
Inhibitor
Name:
BDBM15976
Synonyms:
Aminopyridine-Based Inhibitor 35 N-(4-amino-5-chloro-6-ethoxypyridin-2-yl)-2-(4-methanesulfonyl-2,5-dimethoxyphenyl)acetamide
Type:
Small organic molecule
Emp. Form.:
C18H22ClN3O6S
Mol. Mass.:
443.902
SMILES:
CCOc1nc(NC(=O)Cc2cc(OC)c(cc2OC)S(C)(=O)=O)cc(N)c1Cl
:
Substrate
Name:
biotinylated GST-ATF2
Synonyms:
ATF-2-GST Activating transcription factor 2 GST-ATF2 biotinylated activating transcription factor 2
Type:
Other Protein Type
Mol. Mass.:
12237.77
Organism:
Homo sapiens (Human)
Description:
Residue:
109