Target
Non-receptor tyrosine-protein kinase TYK2
Ligand
BDBM350096
Substrate
Meas. Tech.
Biochemical JAK Kinase Assays
Ki
1.26±n/a nM
Citation
 Fatheree, PRBrandt, GESmith, CSullivan, SDVan Orden, LJKleinschek, MACrater, GD Fused imidazo-piperidine JAK inhibitors US Patent  US10208040 Publication Date 2/19/2019 
Target
Name:
Non-receptor tyrosine-protein kinase TYK2
Synonyms:
Non-receptor tyrosine-protein kinase TYK2 (TYK2) TYK2_HUMAN | Tyrosine-protein kinase TYK2
Type:
Protein
Mol. Mass.:
133666.03
Organism:
Homo sapiens (Human)
Description:
P29597
Residue:
1187
  
Inhibitor
Name:
BDBM350096
Synonyms:
US10208040, Example 1-37
Type:
Small organic molecule
Emp. Form.:
C33H42FN7O2
Mol. Mass.:
587.7307
SMILES:
CCCN1Cc2[nH]c(nc2C[C@H]1C(=O)N1CCN(CC1)C(C)(C)C)-c1n[nH]c2cc(ccc12)-c1cc(F)c(O)cc1CC
: