Target
Tyrosine-protein kinase JAK1
Ligand
BDBM350099
Substrate
Meas. Tech.
Biochemical JAK Kinase Assays
Ki
0.060±n/a nM
Citation
 Fatheree, PRBrandt, GESmith, CSullivan, SDVan Orden, LJKleinschek, MACrater, GD Fused imidazo-piperidine JAK inhibitors US Patent  US10208040 Publication Date 2/19/2019 
Target
Name:
Tyrosine-protein kinase JAK1
Synonyms:
JAK-1 JAK1A JAK1_HUMAN Janus kinase 1 (JAK1) | Janus kinase 1 JAK1
Type:
Protein
Mol. Mass.:
133293.73
Organism:
Homo sapiens (Human)
Description:
P23458
Residue:
1154
  
Inhibitor
Name:
BDBM350099
Synonyms:
US10208040, Example 12-14 US11667637, Example 12-14
Type:
Small organic molecule
Emp. Form.:
C31H40FN7O2
Mol. Mass.:
561.6934
SMILES:
CCN(CC)CCN(C)C(=O)[C@H]1Cc2nc([nH]c2CN1CC)-c1n[nH]c2cc(ccc12)-c1cc(F)c(O)cc1CC
: