Target
Tyrosine-protein kinase JAK3
Ligand
BDBM350099
Substrate
Meas. Tech.
Biochemical JAK Kinase Assays
Ki
0.200±n/a nM
Citation
 Fatheree, PRBrandt, GESmith, CSullivan, SDVan Orden, LJKleinschek, MACrater, GD Fused imidazo-piperidine JAK inhibitors US Patent  US10208040 Publication Date 2/19/2019 
Target
Name:
Tyrosine-protein kinase JAK3
Synonyms:
JAK-3 JAK3_HUMAN Janus kinase 3 (JAK3) L-JAK | Leukocyte janus kinase
Type:
Protein
Mol. Mass.:
125111.08
Organism:
Homo sapiens (Human)
Description:
P52333
Residue:
1124
  
Inhibitor
Name:
BDBM350099
Synonyms:
US10208040, Example 12-14 US11667637, Example 12-14
Type:
Small organic molecule
Emp. Form.:
C31H40FN7O2
Mol. Mass.:
561.6934
SMILES:
CCN(CC)CCN(C)C(=O)[C@H]1Cc2nc([nH]c2CN1CC)-c1n[nH]c2cc(ccc12)-c1cc(F)c(O)cc1CC
: