Target
Serine/threonine-protein kinase haspin
Ligand
BDBM350201
Substrate
Meas. Tech.
Haspin Kinase Assay
IC50
90.6±n/a nM
Citation
 Pastor Fernández, JMartínez González, SBlanco-Aparicio, CHernández Higueras, AIGómez De La Oliva, CARivero Buceta, VRiesco Fagundo, RC Condensed tricyclic compounds as protein kinase inhibitors US Patent  US10208056 Publication Date 2/19/2019 
Target
Name:
Serine/threonine-protein kinase haspin
Synonyms:
GSG2 H-haspin HASP_HUMAN | Haploid germ cell-specific nuclear protein kinase
Type:
PROTEIN
Mol. Mass.:
88531.28
Organism:
Homo sapiens (Human)
Description:
ChEMBL_1510616
Residue:
798
  
Inhibitor
Name:
BDBM350201
Synonyms:
US10208056, Compound 33
Type:
Small organic molecule
Emp. Form.:
C15H15N3O2
Mol. Mass.:
269.2985
SMILES:
CC1(C)Oc2cnccc2-c2[nH]c(C(N)=O)c(C=C)c12
: