Target
Serine/threonine-protein kinase haspin
Ligand
BDBM350214
Substrate
Meas. Tech.
Haspin Kinase Assay
IC50
81.3±n/a nM
Citation
 Pastor Fernández, JMartínez González, SBlanco-Aparicio, CHernández Higueras, AIGómez De La Oliva, CARivero Buceta, VRiesco Fagundo, RC Condensed tricyclic compounds as protein kinase inhibitors US Patent  US10208056 Publication Date 2/19/2019 
Target
Name:
Serine/threonine-protein kinase haspin
Synonyms:
GSG2 H-haspin HASP_HUMAN | Haploid germ cell-specific nuclear protein kinase
Type:
PROTEIN
Mol. Mass.:
88531.28
Organism:
Homo sapiens (Human)
Description:
ChEMBL_1510616
Residue:
798
  
Inhibitor
Name:
BDBM350214
Synonyms:
US10208056, Compound 46
Type:
Small organic molecule
Emp. Form.:
C23H24N4O2
Mol. Mass.:
388.4623
SMILES:
NC(=O)c1cc2c([nH]1)-c1ccncc1OC21CCN(CCc2ccccc2)CC1
: