Target
Serine/threonine-protein kinase haspin
Ligand
BDBM350261
Substrate
Meas. Tech.
Haspin Kinase Assay
IC50
106±n/a nM
Citation
 Pastor Fernández, JMartínez González, SBlanco-Aparicio, CHernández Higueras, AIGómez De La Oliva, CARivero Buceta, VRiesco Fagundo, RC Condensed tricyclic compounds as protein kinase inhibitors US Patent  US10208056 Publication Date 2/19/2019 
Target
Name:
Serine/threonine-protein kinase haspin
Synonyms:
GSG2 H-haspin HASP_HUMAN | Haploid germ cell-specific nuclear protein kinase
Type:
PROTEIN
Mol. Mass.:
88531.28
Organism:
Homo sapiens (Human)
Description:
ChEMBL_1510616
Residue:
798
  
Inhibitor
Name:
BDBM350261
Synonyms:
US10208056, Compound 88
Type:
Small organic molecule
Emp. Form.:
C22H23N3O3
Mol. Mass.:
377.4363
SMILES:
CCn1c(C(N)=O)c(c2c1-c1ccncc1OC2(C)C)-c1cccc(OC)c1
: