Target
Mitogen-activated protein kinase 14
Ligand
BDBM16329
Substrate
myelin basic protein
Meas. Tech.
Enzyme Inhibition Assay
pH
7.4±n/a
Temperature
295.15±n/a K
Ki
0.057±n/a nM
Citation
 Liu, CWrobleski, STLin, JAhmed, GMetzger, AWityak, JGillooly, KMShuster, DJMcIntyre, KWPitt, SShen, DRZhang, RFZhang, HDoweyko, AMDiller, DHenderson, IBarrish, JCDodd, JHSchieven, GLLeftheris, K 5-Cyanopyrimidine derivatives as a novel class of potent, selective, and orally active inhibitors of p38alpha MAP kinase. J Med Chem 48:6261-70 (2005)  
Target
Name:
Mitogen-activated protein kinase 14
Synonyms:
CSAID-binding protein CSBP1 CSPB1 MAP kinase 14 MAP kinase p38 alpha MAPK14 MK14_HUMAN Mitogen-activated protein kinase p38 alpha Stress-activated protein kinase 2a | p38 MAP kinase alpha/beta
Type:
Serine/threonine-protein kinase
Mol. Mass.:
41286.76
Organism:
Homo sapiens (Human)
Description:
Q16539
Residue:
360
  
Inhibitor
Name:
BDBM16329
Synonyms:
3-({2-amino-5-cyano-6-[(1-methylethyl)amino]pyrimidin-4-yl}amino)-N-isoxazol-3-yl-4-methylbenzamide 5-Cyanopyrimidine Derivative 25a
Type:
Small organic molecule
Emp. Form.:
C19H20N8O2
Mol. Mass.:
392.4145
SMILES:
CC(C)Nc1nc(N)nc(Nc2cc(ccc2C)C(=O)Nc2ccon2)c1C#N
:
Substrate
Name:
myelin basic protein
Synonyms:
MBP Myelin A1 protein biotin-MBP protein | biotin-myelin basic protein
Type:
Other Protein Type
Mol. Mass.:
33133.33
Organism:
Homo sapiens (Human)
Description:
Residue:
304