Target
Aldo-keto reductase family 1 member B1 [W220Y,C299A]
Ligand
BDBM16415
Substrate
BDBM16416
Meas. Tech.
Enzyme Inhibition Assay
Ki
7500±n/a nM
Citation
 Brownlee, JMCarlson, EMilne, ACPape, EHarrison, DH Structural and thermodynamic studies of simple aldose reductase-inhibitor complexes. Bioorg Chem 34:424-44 (2006)  
Target
Name:
Aldo-keto reductase family 1 member B1 [W220Y,C299A]
Synonyms:
AKR1B1 ALDR_HUMAN AR | Aldose Reductase (ALR2) Mutant (C299A/W220Y)
Type:
Enzyme
Mol. Mass.:
35800.39
Organism:
Homo sapiens (Human)
Description:
P15121[W220Y,C299A]
Residue:
316
  
Inhibitor
Name:
BDBM16415
Synonyms:
(1,3-dioxo-1H-benzo[de]isoquinolin-2(3H)-yl)acetic acid Alrestatin PiG Tocris-0485
Type:
Small organic molecule
Emp. Form.:
C14H9NO4
Mol. Mass.:
255.2256
SMILES:
OC(=O)CN1C(=O)c2cccc3cccc(C1=O)c23
:
Substrate
Name:
BDBM16416
Synonyms:
pentane-1,2,3,4,5-pentol | xylitol
Type:
Small organic molecule
Emp. Form.:
C5H12O5
Mol. Mass.:
152.1458
SMILES:
OCC(O)C(O)C(O)CO
: