Target
Diacylglycerol O-acyltransferase 1
Ligand
BDBM321146
Substrate
Meas. Tech.
Lipid Extraction (LE) Assay
IC50
101±n/a nM
Citation
 Cheung, MTangirala, RS Compounds as diacylglycerol acyltransferase inhibitors US Patent  US9796729 Publication Date 10/24/2017 
Target
Name:
Diacylglycerol O-acyltransferase 1
Synonyms:
ACAT-related gene product 1 Acyl coA-diacylglycerol acyl transferase 1 (DGAT1) DGAT1 Diacylglycerol Acyltransferase (DGAT1) Diacylglycerol O-acyltransferase 1 (DGAT1) | Diglyceride acyltransferase
Type:
Protein
Mol. Mass.:
55297.82
Organism:
Homo sapiens (Human)
Description:
O75907
Residue:
488
  
Inhibitor
Name:
BDBM321146
Synonyms:
US10174049, Example 13 US9796729, 13
Type:
Small organic molecule
Emp. Form.:
C20H17N7O2
Mol. Mass.:
387.3947
SMILES:
Cc1ncc(cn1)-n1ccc2cc(ccc12)N1CCOc2ncnc(N)c2C1=O
: