Target
Carbonic anhydrase 5A, mitochondrial
Ligand
BDBM11634
Substrate
BDBM10856
Meas. Tech.
Esterase Assay
Ki
14±n/a nM
Citation
 Vullo, DFranchi, MGallori, EAntel, JScozzafava, ASupuran, CT Carbonic anhydrase inhibitors. Inhibition of mitochondrial isozyme V with aromatic and heterocyclic sulfonamides. J Med Chem 47:1272-9 (2004)  
Target
Name:
Carbonic anhydrase 5A, mitochondrial
Synonyms:
CAH5A_MOUSE Ca5a Car5a Carbonic Anhydrase V Carbonic anhydrase 5A, mitochondrial precursor
Type:
Enzyme
Mol. Mass.:
34081.17
Organism:
Mus musculus (mouse)
Description:
Full length murine, cloned isozyme.
Residue:
299
  
Inhibitor
Name:
BDBM11634
Synonyms:
2,3,4,5,6-pentafluoro-N-(3-methyl-5-sulfamoyl-2,3-dihydro-1,3,4-thiadiazol-2-ylidene)benzamide heterocyclic sulfonamide compound 38
Type:
Small organic molecule
Emp. Form.:
C10H5F5N4O3S2
Mol. Mass.:
388.294
SMILES:
Cn1nc(sc1=NC(=O)c1c(F)c(F)c(F)c(F)c1F)S(N)(=O)=O
:
Substrate
Name:
BDBM10856
Synonyms:
Carbon Dioxide | methanedione
Type:
Small organic molecule
Emp. Form.:
CO2
Mol. Mass.:
44.0095
SMILES:
O=C=O
: