Target
5-hydroxytryptamine receptor 7
Ligand
BDBM352200
Substrate
Meas. Tech.
Radiolabel Binding Assay
IC50
10.00±n/a nM
Citation
 Canney, DJBlass, BEGao, RAbou-Gharbia, M 5-hydroxytryptamine receptor 7 activity modulators and their method of use US Patent  US9802924 Publication Date 10/31/2017 
Target
Name:
5-hydroxytryptamine receptor 7
Synonyms:
5-HT-7 5-HT7 5-HT7S 5HT7 HTR7 | Serotonin receptor 7
Type:
G Protein-Coupled Receptor (GPCR)
Mol. Mass.:
53573.08
Organism:
Homo sapiens (Human)
Description:
P34969
Residue:
479
  
Inhibitor
Name:
BDBM352200
Synonyms:
US10239868, Entry 4 US10676464, Entry 4 | US9802924, Entry 4
Type:
Small organic molecule
Emp. Form.:
C21H32N2O2
Mol. Mass.:
344.491
SMILES:
CCC1(CC)CC(CCN2CCN(CC2)c2ccc(C)cc2)OC1=O
: