Target
Cyclin-dependent kinase 4/G1/S-specific cyclin-D1
Ligand
BDBM2579
Substrate
Retinoblastoma (Rb)
Meas. Tech.
CDK4 Activity Assay
pH
7.5±n/a
Temperature
303.15±n/a K
Ki
41±6 nM
Comments
The apparent Km for ATP in the CDK4 assay was about 25 uM.
Citation
 Zhao, BBower, MJMcDevitt, PJZhao, HDavis, STJohanson, KOGreen, SMConcha, NOZhou, BB Structural basis for Chk1 inhibition by UCN-01. J Biol Chem 277:46609-15 (2002)  
Target
Name:
Cyclin-dependent kinase 4/G1/S-specific cyclin-D1
Synonyms:
CDK4/CycD CDK4/Cyclin D1 Cyclin-Dependent Kinase 4 (CDK4) Cyclin-dependent kinase 4/G1/S-specific cyclin D1 | Cyclin-dependent kinase 4/cyclin D1
Type:
Protein Complex
Mol. Mass.:
Description:
CDK4/D1 complexes were purified from insect cells co-infected with baculovirus vectors containing each of the components.
Components:
This complex has 2 components.
Component 1
Name:
Cyclin-dependent kinase 4
Synonyms:
CDK4 Cell division protein kinase 4 PSK-J3
Type:
Enzyme Subunit
Mol. Mass.:
33731.96
Organism:
Homo sapiens (Human)
Description:
P11802
Residue:
303
  
Component 2
Name:
G1/S-specific cyclin-D1
Synonyms:
B-cell lymphoma 1 protein BCL-1 oncogene CCND1 PRAD1 | PRAD1 oncogene
Type:
Enzyme Subunit
Mol. Mass.:
33717.70
Organism:
Homo sapiens (Human)
Description:
Residue:
295
  
Inhibitor
Name:
BDBM2579
Synonyms:
(2S,3R,4R,6R)-3-methoxy-2-methyl-4-(methylamino)-29-oxa-1,7,17-triazaoctacyclo[12.12.2.1^{2,6}.0^{7,28}.0^{8,13}.0^{15,19}.0^{20,27}.0^{21,26}]nonacosa-8(13),9,11,14(28),15(19),20(27),21(26),22,24-nonaen-16-one Staurosporin, 4 Staurosporine, 8 US9206188, Staurosporine | US9226923, Staurosporine
Type:
Small organic molecule
Emp. Form.:
C28H26N4O3
Mol. Mass.:
466.531
SMILES:
CN[C@@H]1C[C@H]2O[C@@](C)([C@@H]1OC)n1c3ccccc3c3c4CNC(=O)c4c4c5ccccc5n2c4c13
:
Substrate
Name:
Retinoblastoma (Rb)
Synonyms:
RB1 Rb p105-Rb pp110
Type:
Other Protein Type
Mol. Mass.:
17470.92
Organism:
Homo sapiens (Human)
Description:
Recombinant fusion protein containing the C-terminal fragment (residues 773-928)
Residue:
156