Target
Coagulation factor X
Ligand
BDBM17227
Substrate
BDBM12658
Meas. Tech.
Enzyme Inhibition Assay
pH
7.5±n/a
Temperature
295.15±n/a K
Ki
0.6±n/a nM
Citation
 Kochanny, MJAdler, MEwing, JGriedel, BDHo, EKaranjawala, RLee, WLentz, DLiang, AMMorrissey, MMPhillips, GBPost, JSacchi, KLSakata, STSubramanyam, BVergona, RWalters, JWhite, KAWhitlow, MYe, BZhao, ZShaw, KJ Substituted thiophene-anthranilamides as potent inhibitors of human factor Xa. Bioorg Med Chem 15:2127-46 (2007)  
Target
Name:
Coagulation factor X
Synonyms:
Activated coagulation factor X (FXa) Coagulation factor X precursor F10 Factor X heavy chain Factor Xa Stuart-Prower factor
Type:
Enzyme
Mol. Mass.:
54726.60
Organism:
Homo sapiens (Human)
Description:
Residue:
488
  
Inhibitor
Name:
BDBM17227
Synonyms:
3-chloro-N-{4-chloro-2-[(4-chlorophenyl)carbamoyl]phenyl}-1-benzothiophene-2-carboxamide | benzothiophene compound, 4
Type:
Small organic molecule
Emp. Form.:
C22H13Cl3N2O2S
Mol. Mass.:
475.775
SMILES:
Clc1c(sc2ccccc12)C(=O)Nc1ccc(Cl)cc1C(=O)Nc1ccc(Cl)cc1
:
Substrate
Name:
BDBM12658
Synonyms:
4-[({[(1S)-4-carbamimidamido-1-[(4-nitrophenyl)carbamoyl]butyl]carbamoyl}methyl)carbamoyl]-4-[(2S,3S)-3-methyl-2-(phenylformamido)pentanamido]butanoic acid hydrochloride Chromogenic Substrate S-2222 benzoyl-Ile-Glu-Gly-Arg-p-nitroanilide
Type:
Small organic molecule
Emp. Form.:
C32H43N9O9
Mol. Mass.:
697.7387
SMILES:
[#6]-[#6]-[#6@H](-[#6])-[#6@H](-[#7]-[#6](=O)-c1ccccc1)-[#6](=O)-[#7]-[#6@@H](-[#6]-[#6]-[#6](-[#8])=O)-[#6](=O)-[#7]-[#6]-[#6](=O)-[#7]-[#6@@H](-[#6]-[#6]-[#6]\[#7]=[#6](\[#7])-[#7])-[#6](=O)-[#7]-c1ccc(cc1)-[#7+](-[#8-])=O
: