Target
Receptor-interacting serine/threonine-protein kinase 1
Ligand
BDBM356271
Substrate
Meas. Tech.
Fluorescent Polarization Binding (FP Binding) assay
IC50
500±n/a nM
Citation
 Estrada, AAFeng, JAFox, BLeslie, CPLyssikatos, JPPozzan, ASweeney, ZKde Vicente Fidalgo, J Compounds, compositions and methods US Patent  US9815850 Publication Date 11/14/2017 
Target
Name:
Receptor-interacting serine/threonine-protein kinase 1
Synonyms:
Cell death protein RIP RIP-1 RIPK1 Receptor-interacting protein 1
Type:
Enzyme Catalytic Domain
Mol. Mass.:
75926.99
Organism:
Homo sapiens (Human)
Description:
Q13546
Residue:
671
  
Inhibitor
Name:
BDBM356271
Synonyms:
US10604535, Example 169 US9815850, Compound 169 US9896458, No. 169
Type:
Small organic molecule
Emp. Form.:
C19H18N6O3
Mol. Mass.:
378.3846
SMILES:
CN1c2ncccc2OC[C@H](NC(=O)c2nnc(Cc3ccccc3)[nH]2)C1=O
: