Target
Vascular endothelial growth factor receptor 2
Ligand
BDBM17683
Substrate
Gastrin Peptide Substrate
Meas. Tech.
HTRF Kinase Inhibition Assay
pH
7.5±n/a
Temperature
295.15±n/a K
Ki
3±n/a nM
Citation
 Potashman, MHBready, JCoxon, ADemelfi, TMDipietro, LDoerr, NElbaum, DEstrada, JGallant, PGermain, JGu, YHarmange, JCKaufman, SAKendall, RKim, JLKumar, GNLong, AMNeervannan, SPatel, VFPolverino, ARose, PPlas, SVWhittington, DZanon, RZhao, H Design, Synthesis, and Evaluation of Orally Active Benzimidazoles and Benzoxazoles as Vascular Endothelial Growth Factor-2 Receptor Tyrosine Kinase Inhibitors. J Med Chem 50:4351-4373 (2007)  
Target
Name:
Vascular endothelial growth factor receptor 2
Synonyms:
CD_antigen=CD309 Fetal liver kinase 1 (FLK-1) KDR Protein-tyrosine kinase receptor Flk-1 VEGFR-2 VEGFR2 Vascular Endothelial Growth Factor Receptor Kinase 2 Vascular endothelial growth factor receptor 2 (KDR) Vascular endothelial growth factor receptor 2 (VEGFR2) Vascular endothelial growth factor receptor-2 (VEGFR-2)
Type:
Receptor Tyrosine Kinase
Mol. Mass.:
151510.97
Organism:
Homo sapiens (Human)
Description:
P35968
Residue:
1356
  
Inhibitor
Name:
BDBM17683
Synonyms:
2-aminobenzimidazole, 8 | 4-{[2-({3-[2-(dimethylamino)ethoxy]-4-(trifluoromethyl)phenyl}amino)-1H-1,3-benzodiazol-5-yl]oxy}-N-methylpyridine-2-carboxamide
Type:
Small organic molecule
Emp. Form.:
C25H25F3N6O3
Mol. Mass.:
514.4996
SMILES:
CNC(=O)c1cc(Oc2ccc3nc(Nc4ccc(c(OCCN(C)C)c4)C(F)(F)F)[nH]c3c2)ccn1
:
Substrate
Name:
Gastrin Peptide Substrate
Synonyms:
Biotinylated gastrin peptide substrate gastrin substrate
Type:
Peptide
Mol. Mass.:
1823.88
Organism:
Description:
Residue:
15
ITINEEEEAYGWLDF