Target
Vascular endothelial growth factor receptor 2
Ligand
BDBM17824
Substrate
biotinylated VEGFR peptide substrate
Meas. Tech.
Homogeneous Time-Resolved Fluorescence (HTRF) Enzyme Assay
IC50
1.5±n/a nM
Citation
 Hasegawa, MNishigaki, NWashio, YKano, KHarris, PASato, HMori, IWest, RIShibahara, MToyoda, HWang, LNolte, RTVeal, JMCheung, M Discovery of Novel Benzimidazoles as Potent Inhibitors of TIE-2 and VEGFR-2 Tyrosine Kinase Receptors. J Med Chem 50:4453-70 (2007)  
Target
Name:
Vascular endothelial growth factor receptor 2
Synonyms:
CD_antigen=CD309 Fetal liver kinase 1 (FLK-1) KDR Protein-tyrosine kinase receptor Flk-1 VEGFR-2 VEGFR2 Vascular Endothelial Growth Factor Receptor Kinase 2 Vascular endothelial growth factor receptor 2 (KDR) Vascular endothelial growth factor receptor 2 (VEGFR2) Vascular endothelial growth factor receptor-2 (VEGFR-2)
Type:
Receptor Tyrosine Kinase
Mol. Mass.:
151510.97
Organism:
Homo sapiens (Human)
Description:
P35968
Residue:
1356
  
Inhibitor
Name:
BDBM17824
Synonyms:
N-{6-[4-({[2-fluoro-5-(trifluoromethyl)phenyl]carbamoyl}amino)phenoxy]-1H-1,3-benzodiazol-2-yl}-2-(4-methylpiperazin-1-yl)acetamide | benzimidazole-urea, 52
Type:
Small organic molecule
Emp. Form.:
C28H27F4N7O3
Mol. Mass.:
585.5527
SMILES:
CN1CCN(CC(=O)Nc2nc3ccc(Oc4ccc(NC(=O)Nc5cc(ccc5F)C(F)(F)F)cc4)cc3[nH]2)CC1
:
Substrate
Name:
biotinylated VEGFR peptide substrate
Synonyms:
Type:
Peptide
Mol. Mass.:
3433.86
Organism:
Description:
Residue:
28