Target
Coagulation factor XI
Ligand
BDBM357058
Substrate
Meas. Tech.
Factor XIa Assay
Ki
0.110±n/a nM
Citation
 Xu, JAli, AZhou, WGao, YEdmondson, SDMertz, ENeelamkavil, SFLiu, WSun, WShen, DHarper, BZhu, CBara, TLim, YYang, M Factor XIA inhibitors US Patent  US10214512 Publication Date 2/26/2019 
Target
Name:
Coagulation factor XI
Synonyms:
Coagulation factor XIa Coagulation factor XIa light chain FA11_HUMAN Factor XIa PTA | Plasma thromboplastin antecedent
Type:
Enzyme
Mol. Mass.:
70130.58
Organism:
Homo sapiens (Human)
Description:
P03951
Residue:
625
  
Inhibitor
Name:
BDBM357058
Synonyms:
US10214512, Example 38
Type:
Small organic molecule
Emp. Form.:
C36H33ClN6O4
Mol. Mass.:
649.138
SMILES:
COC(=O)Nc1ccc-2c(NC(=O)CCCC[C@@H](c3cccc-2c3)c2ccc(c[n+]2[O-])-c2cc(Cl)ccc2-n2cc(nn2)C2CC2)c1
: