Target
Cathepsin S
Ligand
BDBM19489
Substrate
BDBM19490
Meas. Tech.
Enzyme Inhibition Assay
pH
6.5±n/a
Temperature
295.15±n/a K
IC50
178±n/a nM
Citation
 Gauthier, JYBlack, WCCourchesne, ICromlish, WDesmarais, SHoule, RLamontagne, SLi, CSMassé, FMcKay, DJOuellet, MRobichaud, JTruchon, JFTruong, VLWang, QPercival, MD The identification of potent, selective, and bioavailable cathepsin S inhibitors. Bioorg Med Chem Lett 17:4929-33 (2007)  
Target
Name:
Cathepsin S
Synonyms:
CATS_HUMAN Cathepsin S (Cat S) | cathepsin S preproprotein
Type:
Protein
Mol. Mass.:
37507.38
Organism:
Homo sapiens (Human)
Description:
P25774
Residue:
331
  
Inhibitor
Name:
BDBM19489
Synonyms:
(2S)-N-(cyanomethyl)-4-methyl-2-[[(1S)-2,2,2-trifluoro-1-[4-(4-methylsulfon CHEMBL437501 | L-873724
Type:
Small organic molecule
Emp. Form.:
C23H26F3N3O3S
Mol. Mass.:
481.531
SMILES:
CC(C)C[C@H](N[C@@H](c1ccc(cc1)-c1ccc(cc1)S(C)(=O)=O)C(F)(F)F)C(=O)NCC#N
:
Substrate
Name:
BDBM19490
Synonyms:
Cbz-Val-Val-Arg-AMC Z-Val-Val-Arg-AMC
Type:
Emp. Form.:
Mol. Mass.:
SMILES:
: