Target
Cathepsin S
Ligand
BDBM19503
Substrate
BDBM19490
Meas. Tech.
Enzyme Inhibition Assay
pH
6.5±n/a
Temperature
295.15±n/a K
IC50
0.5±n/a nM
Citation
 Gauthier, JYBlack, WCCourchesne, ICromlish, WDesmarais, SHoule, RLamontagne, SLi, CSMassé, FMcKay, DJOuellet, MRobichaud, JTruchon, JFTruong, VLWang, QPercival, MD The identification of potent, selective, and bioavailable cathepsin S inhibitors. Bioorg Med Chem Lett 17:4929-33 (2007)  
Target
Name:
Cathepsin S
Synonyms:
CATS_HUMAN Cathepsin S (Cat S) | cathepsin S preproprotein
Type:
Protein
Mol. Mass.:
37507.38
Organism:
Homo sapiens (Human)
Description:
P25774
Residue:
331
  
Inhibitor
Name:
BDBM19503
Synonyms:
(2R)-N-(1-cyanocyclopropyl)-3-{[(4-fluorophenyl)methane]sulfonyl}-2-{[(1S)-2,2,2-trifluoro-1-phenylethyl]amino}propanamide | trifluoroethylamine inhibitor, 13
Type:
Small organic molecule
Emp. Form.:
C22H21F4N3O3S
Mol. Mass.:
483.479
SMILES:
Fc1ccc(CS(=O)(=O)C[C@H](N[C@@H](c2ccccc2)C(F)(F)F)C(=O)NC2(CC2)C#N)cc1
:
Substrate
Name:
BDBM19490
Synonyms:
Cbz-Val-Val-Arg-AMC Z-Val-Val-Arg-AMC
Type:
Emp. Form.:
Mol. Mass.:
SMILES:
: