Target
Cathepsin K
Ligand
BDBM19516
Substrate
BDBM19480
Meas. Tech.
Enzyme Inhibition Assay
IC50
6.2±n/a nM
Citation
 Gauthier, JYBlack, WCCourchesne, ICromlish, WDesmarais, SHoule, RLamontagne, SLi, CSMassé, FMcKay, DJOuellet, MRobichaud, JTruchon, JFTruong, VLWang, QPercival, MD The identification of potent, selective, and bioavailable cathepsin S inhibitors. Bioorg Med Chem Lett 17:4929-33 (2007)  
Target
Name:
Cathepsin K
Synonyms:
CATK_RABIT | CTSK
Type:
Enzyme
Mol. Mass.:
36879.51
Organism:
Oryctolagus cuniculus (rabbit)
Description:
Residue:
329
  
Inhibitor
Name:
BDBM19516
Synonyms:
(2S)-N-[(3S,5E)-6-(benzenesulfonyl)-4-oxo-1-phenylhex-5-en-3-yl]-4-methyl-2-(morpholin-4-ylcarbonylamino)pentanamide LHVS Morpholinurea-Leucine-Homophenylalaninevinyl Phenyl Sulfone
Type:
Small organic molecule
Emp. Form.:
C28H37N3O5S
Mol. Mass.:
527.675
SMILES:
CC(C)C[C@@H](NC(=O)N1CCOCC1)C(=O)N[C@H](CCc1ccccc1)C=CS(=O)(=O)c1ccccc1
:
Substrate
Name:
BDBM19480
Synonyms:
Cbz-Leu-Arg-AMC Z-Leu-Arg-AMC
Type:
Emp. Form.:
Mol. Mass.:
SMILES:
: