Target
Procathepsin L
Ligand
BDBM19503
Substrate
BDBM19480
Meas. Tech.
Enzyme Inhibition Assay
IC50
86±n/a nM
Citation
 Gauthier, JYBlack, WCCourchesne, ICromlish, WDesmarais, SHoule, RLamontagne, SLi, CSMassé, FMcKay, DJOuellet, MRobichaud, JTruchon, JFTruong, VLWang, QPercival, MD The identification of potent, selective, and bioavailable cathepsin S inhibitors. Bioorg Med Chem Lett 17:4929-33 (2007)  
Target
Name:
Procathepsin L
Synonyms:
CATL1_HUMAN CTSL CTSL1 Cathepsin L Cathepsin L1 heavy chain MEP cathepsin L preproprotein
Type:
Enzyme
Mol. Mass.:
37557.19
Organism:
Homo sapiens (Human)
Description:
Purchased from Calbiochem (San Diego, CA).
Residue:
333
  
Inhibitor
Name:
BDBM19503
Synonyms:
(2R)-N-(1-cyanocyclopropyl)-3-{[(4-fluorophenyl)methane]sulfonyl}-2-{[(1S)-2,2,2-trifluoro-1-phenylethyl]amino}propanamide | trifluoroethylamine inhibitor, 13
Type:
Small organic molecule
Emp. Form.:
C22H21F4N3O3S
Mol. Mass.:
483.479
SMILES:
Fc1ccc(CS(=O)(=O)C[C@H](N[C@@H](c2ccccc2)C(F)(F)F)C(=O)NC2(CC2)C#N)cc1
:
Substrate
Name:
BDBM19480
Synonyms:
Cbz-Leu-Arg-AMC Z-Leu-Arg-AMC
Type:
Emp. Form.:
Mol. Mass.:
SMILES:
: