Target
Oxysterols receptor LXR-alpha
Ligand
BDBM20165
Substrate
biotinylated SRC-1 peptide
Meas. Tech.
Cell-Free Ligand Sensing Assay (LiSA)-LXRalpha-SRC1 Assay
pH
7.5±n/a
Temperature
295.15±n/a K
EC50
260±60 nM
Comments
The relative efficacy (RE) compared to 24(S),25-epoxycholesterol is 0.2 in LXRalpha-SRC1 assay.
Citation
 Collins, JLFivush, AMWatson, MAGalardi, CMLewis, MCMoore, LBParks, DJWilson, JGTippin, TKBinz, JGPlunket, KDMorgan, DGBeaudet, EJWhitney, KDKliewer, SAWillson, TM Identification of a nonsteroidal liver X receptor agonist through parallel array synthesis of tertiary amines. J Med Chem 45:1963-6 (2002)  
Target
Name:
Oxysterols receptor LXR-alpha
Synonyms:
LXRA Liver X receptor alpha Liver X receptor alpha (NR1H3) NR1H3 Nuclear orphan receptor LXR-alpha | Nuclear receptor subfamily 1 group H member 3
Type:
Enzyme Catalytic Domain
Mol. Mass.:
50403.85
Organism:
Homo sapiens (Human)
Description:
Q13133
Residue:
447
  
Inhibitor
Name:
BDBM20165
Synonyms:
3-(3-{[(3,4-dimethoxyphenyl)methyl](2,2-diphenylethyl)amino}propoxy)benzamide | Tertiary amine, 3
Type:
Small organic molecule
Emp. Form.:
C33H36N2O4
Mol. Mass.:
524.6499
SMILES:
COc1ccc(CN(CCCOc2cccc(c2)C(N)=O)CC(c2ccccc2)c2ccccc2)cc1OC
:
Substrate
Name:
biotinylated SRC-1 peptide
Synonyms:
Type:
Peptide
Mol. Mass.:
3157.52
Organism:
Description:
A biotinylated peptide comprises amino acids 675-699 of steroid receptor coactivator 1 (SRC1).
Residue:
28