Target
P2X purinoceptor 4
Ligand
BDBM366078
Substrate
Meas. Tech.
Inhibition Activity Assay
IC50
77.0±n/a nM
Citation
 Sakuma, SKobayashi, KUshioda, MSaito, DImai, TInoue, K P2X4 receptor antagonist US Patent  US9873683 Publication Date 1/23/2018 
Target
Name:
P2X purinoceptor 4
Synonyms:
ATP receptor P2RX4_HUMAN Purinergic receptor | Purinergic, P2X4
Type:
Enzyme Catalytic Domain
Mol. Mass.:
43374.70
Organism:
Homo sapiens (Human)
Description:
Purinergic, P2X4 0 HUMAN::Q99571
Residue:
388
  
Inhibitor
Name:
BDBM366078
Synonyms:
5-[6-[5-(2-Hydroxybenzyl)-1H-tetrazol-1-yl]pyridin-3-yl]-1H-naphtho[1,2-b][1,4]diazepine-2,4(3H,5H)-dione | US9873683, Example 11
Type:
Small organic molecule
Emp. Form.:
C26H19N7O3
Mol. Mass.:
477.4742
SMILES:
Oc1ccccc1Cc1nnnn1-c1ccc(cn1)N1c2ccc3ccccc3c2NC(=O)CC1=O
: