Target
D(3) dopamine receptor
Ligand
BDBM50192284
Substrate
Meas. Tech.
[125I]-7OH-PIPAT Binding Assay
Ki
28.2±n/a nM
Citation
 Cremonesi, SMicheli, FSemerano, TTarsi, L Dopamine D3 receptor antagonists US Patent  US10239870 Publication Date 3/26/2019 
Target
Name:
D(3) dopamine receptor
Synonyms:
DOPAMINE D3 Dopamine D3 receptor | Drd3
Type:
Protein
Mol. Mass.:
49540.58
Organism:
Rattus norvegicus (Rat)
Description:
P19020
Residue:
446
  
Inhibitor
Name:
BDBM50192284
Synonyms:
CHEMBL3901211 | US10239870, Example 15
Type:
Small organic molecule
Emp. Form.:
C22H27N5OS
Mol. Mass.:
409.548
SMILES:
Cc1ncoc1-c1nnc(SCCCN2CC[C@@]3(C[C@@H]3c3ccccc3)C2)n1C
: