Target
D(3) dopamine receptor
Ligand
BDBM50192449
Substrate
Meas. Tech.
[125I]-7OH-PIPAT Binding Assay
Ki
0.263±n/a nM
Citation
 Cremonesi, SMicheli, FSemerano, TTarsi, L Dopamine D3 receptor antagonists US Patent  US10239870 Publication Date 3/26/2019 
Target
Name:
D(3) dopamine receptor
Synonyms:
DOPAMINE D3 Dopamine D3 receptor | Drd3
Type:
Protein
Mol. Mass.:
49540.58
Organism:
Rattus norvegicus (Rat)
Description:
P19020
Residue:
446
  
Inhibitor
Name:
BDBM50192449
Synonyms:
CHEMBL3950540 | US10239870, Example 283
Type:
Small organic molecule
Emp. Form.:
C26H26F3N5S
Mol. Mass.:
497.578
SMILES:
Cn1c(SCCCN2CC[C@]3(C[C@@H]3c3ccc(cc3)C(F)(F)F)C2)nnc1-c1ccc(cc1)C#N
: