Target
D(3) dopamine receptor
Ligand
BDBM50192318
Substrate
Meas. Tech.
[125I]-7OH-PIPAT Binding Assay
Ki
0.245±n/a nM
Citation
 Cremonesi, SMicheli, FSemerano, TTarsi, L Dopamine D3 receptor antagonists US Patent  US10239870 Publication Date 3/26/2019 
Target
Name:
D(3) dopamine receptor
Synonyms:
DOPAMINE D3 Dopamine D3 receptor | Drd3
Type:
Protein
Mol. Mass.:
49540.58
Organism:
Rattus norvegicus (Rat)
Description:
P19020
Residue:
446
  
Inhibitor
Name:
BDBM50192318
Synonyms:
CHEMBL3979523 | US10239870, Example 284
Type:
Small organic molecule
Emp. Form.:
C27H29F3N4OS
Mol. Mass.:
514.606
SMILES:
CC(=O)c1ccc(cc1)-c1nnc(SCCCN2CC[C@]3(C[C@@H]3c3ccc(cc3)C(F)(F)F)C2)n1C
: