Target
Metabotropic glutamate receptor 5
Ligand
BDBM50113468
Substrate
Meas. Tech.
[3H]-M-MPEP Radioligand Binding Assay
Ki
0.501±n/a nM
Citation
 Christopher, JACongreve, MSAves, SJTehan, BG 4-(3-cyanophenyl)-6-pyridinylpyrimidine mGlu5 modulators US Patent  US10246432 Publication Date 4/2/2019 
Target
Name:
Metabotropic glutamate receptor 5
Synonyms:
GPRC1E GRM5_HUMAN metabotropic glutamate 5 | metabotropic glutamate 5a
Type:
Enzyme
Mol. Mass.:
132484.72
Organism:
Homo sapiens (Human)
Description:
Residue:
1212
  
Inhibitor
Name:
BDBM50113468
Synonyms:
CHEMBL3603915 US10584111, Ex No. 15 | US11584732, Example 15
Type:
Small organic molecule
Emp. Form.:
C14H7ClFN5
Mol. Mass.:
299.69
SMILES:
Fc1c(Cl)cc(cc1-c1cc(ncn1)-n1cccn1)C#N
: