Target
Histamine H4 receptor
Ligand
BDBM22884
Substrate
BDBM7966
Meas. Tech.
H4R Radioligand Binding Assay
Ki
25±n/a nM
Citation
 Lim, HDvan Rijn, RMLing, PBakker, RAThurmond, RLLeurs, R Evaluation of histamine H1-, H2-, and H3-receptor ligands at the human histamine H4 receptor: identification of 4-methylhistamine as the first potent and selective H4 receptor agonist. J Pharmacol Exp Ther 314:1310-21 (2005)  
Target
Name:
Histamine H4 receptor
Synonyms:
AXOR35 GPCR105 HH4R HRH4 Histamine H4 receptor Histamine receptor (H3 and H4) SP9144
Type:
G Protein-Coupled Receptor (GPCR)
Mol. Mass.:
44517.02
Organism:
Homo sapiens (Human)
Description:
Binding assays were using CHO cells stably expressing hH4R receptors.
Residue:
390
  
Inhibitor
Name:
BDBM22884
Synonyms:
2-[3-(1H-imidazol-5-yl)propyl]-1-(2-{[(5-methyl-1H-imidazol-4-yl)methyl]sulfanyl}ethyl)guanidine Impromidine
Type:
Small organic molecule
Emp. Form.:
C14H23N7S
Mol. Mass.:
321.444
SMILES:
Cc1nc[nH]c1CSCCN=C(N)NCCCc1cnc[nH]1
:
Substrate
Name:
BDBM7966
Synonyms:
2-(1H-imidazol-4-yl)ethan-1-amine CHEMBL90 Ergotidine Histamine Peremin | [3H]histamine
Type:
Small organic molecule
Emp. Form.:
C5H9N3
Mol. Mass.:
111.1451
SMILES:
NCCc1cnc[nH]1
: