Target
Oxysterols receptor LXR-alpha
Ligand
BDBM23850
Substrate
BDBM10852
Meas. Tech.
alpha-Glucosidase Inhibition Assay
IC50
4400±n/a nM
Citation
 Dodo, KAoyama, ANoguchi-Yachide, TMakishima, MMiyachi, HHashimoto, Y Co-existence of alpha-glucosidase-inhibitory and liver X receptor-regulatory activities and their separation by structural development. Bioorg Med Chem 16:4272-85 (2008)  
Target
Name:
Oxysterols receptor LXR-alpha
Synonyms:
LXRA Liver X receptor alpha Liver X receptor alpha (NR1H3) NR1H3 Nuclear orphan receptor LXR-alpha | Nuclear receptor subfamily 1 group H member 3
Type:
Enzyme Catalytic Domain
Mol. Mass.:
50403.85
Organism:
Homo sapiens (Human)
Description:
Q13133
Residue:
447
  
Inhibitor
Name:
BDBM23850
Synonyms:
14-oxapentacyclo[20.2.2.2^{10,13}.1^{15,19}.0^{2,7}]nonacosa-1(24),2(7),3,5,10,12,15,17,19(27),22,25,28-dodecaene-5,16-diol | Riccardin C derivative, 20c
Type:
Small organic molecule
Emp. Form.:
C28H24O3
Mol. Mass.:
408.4884
SMILES:
Oc1ccc-2c(CCc3ccc(Oc4cc(CCc5ccc-2cc5)ccc4O)cc3)c1
:
Substrate