Target
Oxysterols receptor LXR-alpha
Ligand
BDBM23853
Substrate
BDBM10852
Meas. Tech.
alpha-Glucosidase Inhibition Assay
IC50
3200±n/a nM
Citation
 Dodo, KAoyama, ANoguchi-Yachide, TMakishima, MMiyachi, HHashimoto, Y Co-existence of alpha-glucosidase-inhibitory and liver X receptor-regulatory activities and their separation by structural development. Bioorg Med Chem 16:4272-85 (2008)  
Target
Name:
Oxysterols receptor LXR-alpha
Synonyms:
LXRA Liver X receptor alpha Liver X receptor alpha (NR1H3) NR1H3 Nuclear orphan receptor LXR-alpha | Nuclear receptor subfamily 1 group H member 3
Type:
Enzyme Catalytic Domain
Mol. Mass.:
50403.85
Organism:
Homo sapiens (Human)
Description:
Q13133
Residue:
447
  
Inhibitor
Name:
BDBM23853
Synonyms:
14-oxapentacyclo[20.2.2.2^{10,13}.1^{15,19}.0^{2,7}]nonacosa-1(25),2(7),3,5,10,12,15,17,19(27),22(26),23,28-dodecaen-24-ol | Riccardin C derivative, 20f
Type:
Small organic molecule
Emp. Form.:
C28H24O2
Mol. Mass.:
392.489
SMILES:
Oc1cc2CCc3cccc(Oc4ccc(CCc5ccccc5-c1cc2)cc4)c3
:
Substrate