Target
Aromatase
Ligand
BDBM24328
Substrate
BDBM8592
Meas. Tech.
Aromatase Inhibition Assay
pH
7.5±n/a
Temperature
310.15±n/a K
IC50
0.33±0.05 nM
Citation
 Woo, LWBubert, CSutcliffe, OBSmith, AChander, SKMahon, MFPurohit, AReed, MJPotter, BV Dual aromatase-steroid sulfatase inhibitors. J Med Chem 50:3540-60 (2007)  
Target
Name:
Aromatase
Synonyms:
ARO1 CP19A_HUMAN CYP19 CYPXIX Cytochrome P450 19A1 Cytochrome P450-C19 (CYP19) FL cytokine receptor precursor | P-450AROM
Type:
Enzyme
Mol. Mass.:
57888.92
Organism:
Homo sapiens (Human)
Description:
P11511
Residue:
503
  
Inhibitor
Name:
BDBM24328
Synonyms:
4-{[(4-hydroxy-3-iodophenyl)methyl](4H-1,2,4-triazol-4-yl)amino}benzonitrile | p-phenol, 7f
Type:
Small organic molecule
Emp. Form.:
C16H12IN5O
Mol. Mass.:
417.2039
SMILES:
Oc1ccc(CN(c2ccc(cc2)C#N)n2cnnc2)cc1I
:
Substrate
Name:
BDBM8592
Synonyms:
(2R,15S)-2,15-dimethyltetracyclo[8.7.0.0^{2,7}.0^{11,15}]heptadec-6-ene-5,14-dione Androst-4-ene-3,17-dione [1beta-3H] androstenedione
Type:
Small organic molecule
Emp. Form.:
C19H26O2
Mol. Mass.:
286.4085
SMILES:
C[C@]12CCC3C(CCC4=CC(=O)CC[C@]34C)C1CCC2=O
: