Target
Induced myeloid leukemia cell differentiation protein Mcl-1 homolog
Ligand
BDBM380452
Substrate
Meas. Tech.
High-Throughput Competitive Fluorescence Polarization (FP) Screening Assay
IC50
587±n/a nM
Citation
 Walensky, LD Inhibition of MCL-1 and/or BFL-1/A1 US Patent  US9926306 Publication Date 3/27/2018 
Target
Name:
Induced myeloid leukemia cell differentiation protein Mcl-1 homolog
Synonyms:
Bcl-2-related protein EAT/mcl1 Mcl-1 | Mcl1
Type:
Developmental protein
Mol. Mass.:
35215.08
Organism:
Mus musculus (Mouse)
Description:
Residue:
331
  
Inhibitor
Name:
BDBM380452
Synonyms:
US9926306, ID 187-44
Type:
Small organic molecule
Emp. Form.:
C20H25N3O3S
Mol. Mass.:
387.496
SMILES:
Cc1s\c(=N/C2CCCCC2)n(\N=C\c2cc(O)c(O)cc2O)c1C1CC1
: