Target
Induced myeloid leukemia cell differentiation protein Mcl-1 homolog
Ligand
BDBM380456
Substrate
Meas. Tech.
High-Throughput Competitive Fluorescence Polarization (FP) Screening Assay
IC50
937±n/a nM
Citation
 Walensky, LD Inhibition of MCL-1 and/or BFL-1/A1 US Patent  US9926306 Publication Date 3/27/2018 
Target
Name:
Induced myeloid leukemia cell differentiation protein Mcl-1 homolog
Synonyms:
Bcl-2-related protein EAT/mcl1 Mcl-1 | Mcl1
Type:
Developmental protein
Mol. Mass.:
35215.08
Organism:
Mus musculus (Mouse)
Description:
Residue:
331
  
Inhibitor
Name:
BDBM380456
Synonyms:
US9926306, ID 183-82 | US9926306, ID 187-79
Type:
Small organic molecule
Emp. Form.:
C18H21N3O3S
Mol. Mass.:
359.443
SMILES:
Cc1cs\c(=N/C2CC3CCC2C3)n1\N=C\c1cc(O)c(O)cc1O
: