Target
Induced myeloid leukemia cell differentiation protein Mcl-1 homolog
Ligand
BDBM380472
Substrate
Meas. Tech.
High-Throughput Competitive Fluorescence Polarization (FP) Screening Assay
IC50
7.30±n/a nM
Citation
 Walensky, LD Inhibition of MCL-1 and/or BFL-1/A1 US Patent  US9926306 Publication Date 3/27/2018 
Target
Name:
Induced myeloid leukemia cell differentiation protein Mcl-1 homolog
Synonyms:
Bcl-2-related protein EAT/mcl1 Mcl-1 | Mcl1
Type:
Developmental protein
Mol. Mass.:
35215.08
Organism:
Mus musculus (Mouse)
Description:
Residue:
331
  
Inhibitor
Name:
BDBM380472
Synonyms:
US9926306, ID 187-39
Type:
Small organic molecule
Emp. Form.:
C18H23N3O3S
Mol. Mass.:
361.459
SMILES:
CC(C)C(C)\N=c1/scc(C2CC2)n1\N=C\c1cc(O)c(O)cc1O
: