Target
Induced myeloid leukemia cell differentiation protein Mcl-1 homolog
Ligand
BDBM380475
Substrate
Meas. Tech.
High-Throughput Competitive Fluorescence Polarization (FP) Screening Assay
IC50
11.0±n/a nM
Citation
 Walensky, LD Inhibition of MCL-1 and/or BFL-1/A1 US Patent  US9926306 Publication Date 3/27/2018 
Target
Name:
Induced myeloid leukemia cell differentiation protein Mcl-1 homolog
Synonyms:
Bcl-2-related protein EAT/mcl1 Mcl-1 | Mcl1
Type:
Developmental protein
Mol. Mass.:
35215.08
Organism:
Mus musculus (Mouse)
Description:
Residue:
331
  
Inhibitor
Name:
BDBM380475
Synonyms:
US9926306, ID 183-76
Type:
Small organic molecule
Emp. Form.:
C20H21N3O3S2
Mol. Mass.:
415.529
SMILES:
Oc1ccc(\C=N\n2c(cs\c2=N/C2CCCCC2)-c2cccs2)c(O)c1O
: