Target
Induced myeloid leukemia cell differentiation protein Mcl-1 homolog
Ligand
BDBM380482
Substrate
Meas. Tech.
High-Throughput Competitive Fluorescence Polarization (FP) Screening Assay
IC50
17.7±n/a nM
Citation
 Walensky, LD Inhibition of MCL-1 and/or BFL-1/A1 US Patent  US9926306 Publication Date 3/27/2018 
Target
Name:
Induced myeloid leukemia cell differentiation protein Mcl-1 homolog
Synonyms:
Bcl-2-related protein EAT/mcl1 Mcl-1 | Mcl1
Type:
Developmental protein
Mol. Mass.:
35215.08
Organism:
Mus musculus (Mouse)
Description:
Residue:
331
  
Inhibitor
Name:
BDBM380482
Synonyms:
US9926306, ID 183-65
Type:
Small organic molecule
Emp. Form.:
C20H27N3O2S
Mol. Mass.:
373.512
SMILES:
CC(C)(C)c1cs\c(=N/C2CCCCC2)n1\N=C\c1ccc(O)c(O)c1
: