Target
Phosphatidylinositol 4,5-bisphosphate 3-kinase catalytic subunit gamma isoform/Phosphoinositide 3-kinase regulatory subunit 5
Ligand
BDBM15234
Substrate
BDBM15235
Meas. Tech.
PI3Kgamma Inhibition Assay
pH
7.4±n/a
Temperature
303.15±n/a K
IC50
19±n/a nM
Citation
 Lanni, TBGreene, KLKolz, CNPara, KSVisnick, MMobley, JLDudley, DTBaginski, TJLiimatta, MB Design and synthesis of phenethyl benzo[1,4]oxazine-3-ones as potent inhibitors of PI3Kinasegamma. Bioorg Med Chem Lett 17:756-60 (2007)  
Target
Name:
Phosphatidylinositol 4,5-bisphosphate 3-kinase catalytic subunit gamma isoform/Phosphoinositide 3-kinase regulatory subunit 5
Synonyms:
PI3-kinase subunit gamma/Phosphoinositide 3-kinase regulatory subunit 5 | Phosphoinositide 3-Kinase (PI3K), gamma
Type:
Protein Complex
Mol. Mass.:
Description:
Heterodimer of a catalytic subunit (PIK3CG/p120) and a regulatory (PIK3R5a/p101) subunit.
Components:
This complex has 2 components.
Component 1
Name:
Phosphatidylinositol 4,5-bisphosphate 3-kinase catalytic subunit gamma isoform
Synonyms:
PI3-kinase p110 subunit gamma PI3Kgamma PK3CG_HUMAN Phosphatidylinositol 4,5-bisphosphate 3-kinase (PI3K) Phosphatidylinositol 4,5-bisphosphate 3-kinase catalytic subunit gamma (PI3Kgamma) Phosphatidylinositol 4,5-bisphosphate 3-kinase catalytic subunit gamma isoform (PI3K) Phosphatidylinositol-4,5-bisphosphate 3-kinase catalytic subunit gamma isoform Phosphoinositide 3-kinases gamma (PI3K gamma) p120-PI3K
Type:
Enzyme Subunit
Mol. Mass.:
126470.30
Organism:
Homo sapiens (Human)
Description:
P48736
Residue:
1102
  
Component 2
Name:
Phosphoinositide 3-kinase regulatory subunit 5
Synonyms:
IB PI3-kinase p101 subunit PI3R5_HUMAN Phosphatidylinositol-4,5-bisphosphate 3-kinase regulatory subunit Phosphoinositide 3-kinase regulatory subunit 5 p101-PI3K
Type:
Enzyme Subunit
Mol. Mass.:
97349.51
Organism:
Homo sapiens (Human)
Description:
Phosphoinositide 3-kinase regulatory subunit 5, p101-PI3K.
Residue:
880
  
Inhibitor
Name:
BDBM15234
Synonyms:
(1R,3R,5S,9R,18S)-18-(methoxymethyl)-1,5-dimethyl-6,11,16-trioxo-13,17-dioxapentacyclo[10.6.1.0^{2,10}.0^{5,9}.0^{15,19}]nonadeca-2(10),12(19),14-trien-3-yl acetate NSC221019 Wortmannin, Wm | cid_312145
Type:
Antibiotic
Emp. Form.:
C23H24O8
Mol. Mass.:
428.4319
SMILES:
[H][C@@]12CCC(=O)[C@@]1(C)C[C@@H](OC(C)=O)C1=C2C(=O)c2occ3c2[C@]1(C)[C@@H](COC)OC3=O
:
Substrate
Name:
BDBM15235
Synonyms:
L-alpha-Phosphatidylinositol 4,5-bisphosphate PtdInsP2
Type:
Small organic molecule
Emp. Form.:
C47H80O19P3
Mol. Mass.:
1042.0507
SMILES:
CCCCCCCCCCCCCCCCCC(=O)OCC(COP([O-])(=O)O[C@@H]1[C@H](O)[C@H](O)[C@@H](OP([O-])([O-])=O)[C@H](OP([O-])([O-])=O)[C@H]1O)OC(=O)CCC\C=C/C\C=C/C\C=C/C\C=C/CCCCC
: