Target
Sodium-dependent serotonin transporter
Ligand
BDBM25871
Substrate
BDBM25870
Meas. Tech.
SERT In Vitro Binding Assay
pH
7.7±n/a
Temperature
295.15±n/a K
IC50
50±n/a nM
Citation
 Jaro&ngrave;czyk, MChilmonczyk, ZMazurek, APNowak, GRavna, AWKristiansen, KSylte, I The molecular interactions of buspirone analogues with the serotonin transporter. Bioorg Med Chem 16:9283-94 (2008)  
Target
Name:
Sodium-dependent serotonin transporter
Synonyms:
5-HT Transporter 5HTT SC6A4_HUMAN SLC6A4 Serotonin transporter (5HTT) Sodium-dependent serotonin transporter (SERT) | Solute carrier family 6 member 4
Type:
Multi-pass membrane protein
Mol. Mass.:
70322.51
Organism:
Homo sapiens (Human)
Description:
P31645
Residue:
630
  
Inhibitor
Name:
BDBM25871
Synonyms:
1-{4-[2-methyl-4-(quinolin-2-yl)piperazin-1-yl]butyl}piperidine-2,6-dione | buspirone analogue, 2
Type:
Small organic molecule
Emp. Form.:
C23H30N4O2
Mol. Mass.:
394.5099
SMILES:
CC1CN(CCN1CCCCN1C(=O)CCCC1=O)c1ccc2ccccc2n1
:
Substrate
Name:
BDBM25870
Synonyms:
1-[3-(dimethylamino)propyl]-1-(4-fluorophenyl)-1,3-dihydro-2-benzofuran-5-carbonitrile CITALOPRAM Escitalopram [3H]Cytalopram [3H]Lexapro
Type:
radiolabeled ligand
Emp. Form.:
C20H21FN2O
Mol. Mass.:
324.3919
SMILES:
CN(C)CCCC1(OCc2cc(ccc12)C#N)c1ccc(F)cc1
: