Target
Sodium-dependent serotonin transporter
Ligand
BDBM25874
Substrate
BDBM25870
Meas. Tech.
SERT In Vitro Binding Assay
pH
7.7±n/a
Temperature
295.15±n/a K
IC50
95±n/a nM
Citation
 Jaro&ngrave;czyk, MChilmonczyk, ZMazurek, APNowak, GRavna, AWKristiansen, KSylte, I The molecular interactions of buspirone analogues with the serotonin transporter. Bioorg Med Chem 16:9283-94 (2008)  
Target
Name:
Sodium-dependent serotonin transporter
Synonyms:
5-HT Transporter 5HT transporter Anandamid membrane transporter, AMT Monoamine transporters; Norepinephrine & serotonin Slc6a4 Sodium-dependent serotonin transporter (SERT) | imipramine receptor
Type:
Multi-pass membrane protein
Mol. Mass.:
70168.43
Organism:
Rattus norvegicus (rat)
Description:
P31652
Residue:
630
  
Inhibitor
Name:
BDBM25874
Synonyms:
2-{4-[4-(quinolin-2-yl)piperazin-1-yl]butyl}-2,3-dihydro-1H-isoindole-1,3-dione | buspirone analogue, 5
Type:
Small organic molecule
Emp. Form.:
C25H26N4O2
Mol. Mass.:
414.4995
SMILES:
O=C1N(CCCCN2CCN(CC2)c2ccc3ccccc3n2)C(=O)c2ccccc12
:
Substrate
Name:
BDBM25870
Synonyms:
1-[3-(dimethylamino)propyl]-1-(4-fluorophenyl)-1,3-dihydro-2-benzofuran-5-carbonitrile CITALOPRAM Escitalopram [3H]Cytalopram [3H]Lexapro
Type:
radiolabeled ligand
Emp. Form.:
C20H21FN2O
Mol. Mass.:
324.3919
SMILES:
CN(C)CCCC1(OCc2cc(ccc12)C#N)c1ccc(F)cc1
: