Target
Carbonic anhydrase 7
Ligand
BDBM25900
Substrate
BDBM10856
Meas. Tech.
CA Inhibition Assay
Ki
2.8±n/a nM
Citation
 Temperini, CCecchi, AScozzafava, ASupuran, CT Carbonic anhydrase inhibitors. Interaction of indapamide and related diuretics with 12 mammalian isozymes and X-ray crystallographic studies for the indapamide-isozyme II adduct. Bioorg Med Chem Lett 18:2567-73 (2008)  
Target
Name:
Carbonic anhydrase 7
Synonyms:
CA-VII CAH7_HUMAN Carbonic anhydrase Carbonic anhydrase VII (CA VII)
Type:
Enzyme
Mol. Mass.:
29664.11
Organism:
Homo sapiens (Human)
Description:
Human cloned isozyme.
Residue:
264
  
Inhibitor
Name:
BDBM25900
Synonyms:
2-chloro-5-(1-hydroxy-3-oxo-2,3-dihydro-1H-isoindol-1-yl)benzene-1-sulfonamide Chlorthalidone Hygroton US10172837, Chlorthalidone
Type:
Small organic molecule
Emp. Form.:
C14H11ClN2O4S
Mol. Mass.:
338.766
SMILES:
NS(=O)(=O)c1cc(ccc1Cl)C1(O)NC(=O)c2ccccc12
:
Substrate
Name:
BDBM10856
Synonyms:
Carbon Dioxide | methanedione
Type:
Small organic molecule
Emp. Form.:
CO2
Mol. Mass.:
44.0095
SMILES:
O=C=O
: