Target
Phosphodiesterase
Ligand
BDBM384822
Substrate
Meas. Tech.
PDE2 Assay B
Ki
0.110±n/a nM
Citation
 Shen, DWang, DQian, XHarper, BYang, MBo, Y Pyrimidinone amide compounds as PDE2 inhibitors US Patent  US10285989 Publication Date 5/14/2019 
Target
Name:
Phosphodiesterase
Synonyms:
PDE2A3 | Phosphodiesterase A3 (PDE2A3)
Type:
Enzyme Catalytic Domain
Mol. Mass.:
105547.91
Organism:
Macaca mulatta (Rhesus macaque)
Description:
Residue:
941
  
Inhibitor
Name:
BDBM384822
Synonyms:
2-(dimethylamino)-N-{(1R)-2,2- dimethyl-1-[4-(pentafluoro-lambda6- sulfanyl)phenyl]propyl}-6-oxo-1,6- dihydropyrimidine-4-carboxamide | US10285989, Example 38
Type:
Small organic molecule
Emp. Form.:
C18H23F3N4O2S
Mol. Mass.:
416.461
SMILES:
CN(C)c1nc(cc(=O)[nH]1)C(=O)N[C@@H](c1ccc(cc1)S(F)(F)F)C(C)(C)C
: